Reaction Details
TargetSerine/threonine-protein kinase PLK2
LigandBDBM50437840
Substrate/Competitorn/a
Meas. Tech.ChEMBL_973992 (CHEMBL2410317)
IC50>10000±n/a nM
Citation Laufer, RForrest, BLi, SWLiu, YSampson, PEdwards, LLang, YAwrey, DEMao, GPlotnikova, OLeung, GHodgson, RBeletskaya, IMason, JMLuo, XWei, XYao, YFeher, MBan, FKiarash, RGreen, EMak, TWPan, GPauls, HW The discovery of PLK4 inhibitors: (E)-3-((1H-Indazol-6-yl)methylene)indolin-2-ones as novel antiproliferative agents. J Med Chem56:6069-87 (2013) 
 
Serine/threonine-protein kinase PLK2
Name:Serine/threonine-protein kinase PLK2
Type:Serine/threonine-protein kinase
Mol. Mass.:78259.87
Organism:Homo sapiens (Human)
Description:Full-length human PLK2 was expressed as GST-fusion protein using baculovirus expression system. GST-PLK2 was purified by using glutathione sepharose chromatography.
Residue:685
BDBM50437840
NameBDBM50437840
Synonyms:CHEMBL2407744
TypeSmall organic molecule
Emp. Form.C25H17N3O3
Mol. Mass.407.4208
SMILESOC(=O)c1ccc(\C=C\c2n[nH]c3cc(\C=C4\C(=O)Nc5ccccc45)ccc23)cc1