Reaction Details
TargetSerine/threonine-protein kinase PLK2
LigandBDBM50437859
Substrate/Competitorn/a
Meas. Tech.ChEMBL_973992 (CHEMBL2410317)
IC50 8900±n/a nM
Citation Laufer, RForrest, BLi, SWLiu, YSampson, PEdwards, LLang, YAwrey, DEMao, GPlotnikova, OLeung, GHodgson, RBeletskaya, IMason, JMLuo, XWei, XYao, YFeher, MBan, FKiarash, RGreen, EMak, TWPan, GPauls, HW The discovery of PLK4 inhibitors: (E)-3-((1H-Indazol-6-yl)methylene)indolin-2-ones as novel antiproliferative agents. J Med Chem56:6069-87 (2013) 
 
Serine/threonine-protein kinase PLK2
Name:Serine/threonine-protein kinase PLK2
Type:Serine/threonine-protein kinase
Mol. Mass.:78259.87
Organism:Homo sapiens (Human)
Description:Full-length human PLK2 was expressed as GST-fusion protein using baculovirus expression system. GST-PLK2 was purified by using glutathione sepharose chromatography.
Residue:685
BDBM50437859
NameBDBM50437859
Synonyms:CHEMBL2407909
TypeSmall organic molecule
Emp. Form.C15H10N4O
Mol. Mass.262.2661
SMILESO=C1Nc2ccccc2C1=Cc1ccc2nn[nH]c2c1