Reaction Details
TargetCytochrome P450 2D6
LigandBDBM50437842
Substrate/Competitorn/a
Meas. Tech.ChEMBL_973973 (CHEMBL2410120)
IC50 10000±n/a nM
Citation Laufer, RForrest, BLi, SWLiu, YSampson, PEdwards, LLang, YAwrey, DEMao, GPlotnikova, OLeung, GHodgson, RBeletskaya, IMason, JMLuo, XWei, XYao, YFeher, MBan, FKiarash, RGreen, EMak, TWPan, GPauls, HW The discovery of PLK4 inhibitors: (E)-3-((1H-Indazol-6-yl)methylene)indolin-2-ones as novel antiproliferative agents. J Med Chem56:6069-87 (2013) 
 
Cytochrome P450 2D6
Name:Cytochrome P450 2D6
Type:Protein
Mol. Mass.:55774.82
Organism:Homo sapiens (Human)
Description:P10635
Residue:497
BDBM50437842
NameBDBM50437842
Synonyms:CHEMBL2407899
TypeSmall organic molecule
Emp. Form.C28H26N6O
Mol. Mass.462.5456
SMILESCN1CCN(CC1)c1ccc(\C=C\c2n[nH]c3cc(\C=C4\C(=O)Nc5ccccc45)ccc23)cn1