Reaction Details
TargetCytochrome P450 1A2
LigandBDBM50437841
Substrate/Competitorn/a
Meas. Tech.ChEMBL_973972 (CHEMBL2410119)
IC50>10000±n/a nM
Citation Laufer, RForrest, BLi, SWLiu, YSampson, PEdwards, LLang, YAwrey, DEMao, GPlotnikova, OLeung, GHodgson, RBeletskaya, IMason, JMLuo, XWei, XYao, YFeher, MBan, FKiarash, RGreen, EMak, TWPan, GPauls, HW The discovery of PLK4 inhibitors: (E)-3-((1H-Indazol-6-yl)methylene)indolin-2-ones as novel antiproliferative agents. J Med Chem56:6069-87 (2013) 
 
Cytochrome P450 1A2
Name:Cytochrome P450 1A2
Type:Enzyme
Mol. Mass.:58423.38
Organism:Homo sapiens (Human)
Description:P05177
Residue:516
BDBM50437841
NameBDBM50437841
Synonyms:CHEMBL2407900
TypeSmall organic molecule
Emp. Form.C29H28N6O2
Mol. Mass.492.5716
SMILESCOc1ccc2NC(=O)\C(=C\c3ccc4c(\C=C\c5ccc(nc5)N5CCN(C)CC5)n[nH]c4c3)c2c1