Reaction Details
TargetAlkaline phosphatase, tissue-nonspecific isozyme
LigandBDBM50437928
Substrate/Competitorn/a
Meas. Tech.ChEMBL_972806 (CHEMBL2411274)
Ki 38000±n/a nM
Citation al-Rashida, MRaza, RAbbas, GShah, MSKostakis, GELecka, JSévigny, JMuddassar, MPapatriantafyllopoulou, CIqbal, J Identification of novel chromone based sulfonamides as highly potent and selective inhibitors of alkaline phosphatases. Eur J Med Chem66:438-49 (2013) 
 
Alkaline phosphatase, tissue-nonspecific isozyme
Name:Alkaline phosphatase, tissue-nonspecific isozyme
Type:Protein
Mol. Mass.:57195.60
Organism:Bos taurus (Cattle)
Description:P09487
Residue:524
BDBM50437928
NameBDBM50437928
Synonyms:CHEMBL2408697
TypeSmall organic molecule
Emp. Form.C23H22N4O6S
Mol. Mass.482.509
SMILESCCOC1Oc2ccccc2C(=O)C1=CNc1ccc(cc1)S(=O)(=O)Nc1ccc(OC)nn1