Reaction Details
TargetAlkaline phosphatase, tissue-nonspecific isozyme
LigandBDBM50437932
Substrate/Competitorn/a
Meas. Tech.ChEMBL_972806 (CHEMBL2411274)
Ki 21000±n/a nM
Citation al-Rashida, MRaza, RAbbas, GShah, MSKostakis, GELecka, JSévigny, JMuddassar, MPapatriantafyllopoulou, CIqbal, J Identification of novel chromone based sulfonamides as highly potent and selective inhibitors of alkaline phosphatases. Eur J Med Chem66:438-49 (2013) 
 
Alkaline phosphatase, tissue-nonspecific isozyme
Name:Alkaline phosphatase, tissue-nonspecific isozyme
Type:Protein
Mol. Mass.:57195.60
Organism:Bos taurus (Cattle)
Description:P09487
Residue:524
BDBM50437932
NameBDBM50437932
Synonyms:CHEMBL2408704
TypeSmall organic molecule
Emp. Form.C21H19FN4O5S2
Mol. Mass.490.528
SMILESCCOC1Oc2ccc(F)cc2C(=O)C1=CNc1ccc(cc1)S(=O)(=O)Nc1nnc(C)s1