Reaction Details
TargetAlkaline phosphatase, tissue-nonspecific isozyme
LigandBDBM50437938
Substrate/Competitorn/a
Meas. Tech.ChEMBL_972806 (CHEMBL2411274)
Ki 16800±n/a nM
Citation al-Rashida, MRaza, RAbbas, GShah, MSKostakis, GELecka, JSévigny, JMuddassar, MPapatriantafyllopoulou, CIqbal, J Identification of novel chromone based sulfonamides as highly potent and selective inhibitors of alkaline phosphatases. Eur J Med Chem66:438-49 (2013) 
 
Alkaline phosphatase, tissue-nonspecific isozyme
Name:Alkaline phosphatase, tissue-nonspecific isozyme
Type:Protein
Mol. Mass.:57195.60
Organism:Bos taurus (Cattle)
Description:P09487
Residue:524
BDBM50437938
NameBDBM50437938
Synonyms:CHEMBL1814400
TypeSmall organic molecule
Emp. Form.C20H22N2O5S
Mol. Mass.402.464
SMILESCCOC1Oc2ccc(CC)cc2C(=O)C1=CNc1cccc(c1)S(N)(=O)=O