Reaction Details
TargetIntestinal-type alkaline phosphatase
LigandBDBM50437932
Substrate/Competitorn/a
Meas. Tech.ChEMBL_972808 (CHEMBL2411276)
Ki 10.0±n/a nM
Citation al-Rashida, MRaza, RAbbas, GShah, MSKostakis, GELecka, JSévigny, JMuddassar, MPapatriantafyllopoulou, CIqbal, J Identification of novel chromone based sulfonamides as highly potent and selective inhibitors of alkaline phosphatases. Eur J Med Chem66:438-49 (2013) 
 
Intestinal-type alkaline phosphatase
Name:Intestinal-type alkaline phosphatase
Type:Protein
Mol. Mass.:57094.82
Organism:Bos taurus (Cattle)
Description:P19111
Residue:533
BDBM50437932
NameBDBM50437932
Synonyms:CHEMBL2408704
TypeSmall organic molecule
Emp. Form.C21H19FN4O5S2
Mol. Mass.490.528
SMILESCCOC1Oc2ccc(F)cc2C(=O)C1=CNc1ccc(cc1)S(=O)(=O)Nc1nnc(C)s1