Reaction Details
TargetIntestinal-type alkaline phosphatase
LigandBDBM50437936
Substrate/Competitorn/a
Meas. Tech.ChEMBL_972808 (CHEMBL2411276)
Ki 780±n/a nM
Citation al-Rashida, MRaza, RAbbas, GShah, MSKostakis, GELecka, JSévigny, JMuddassar, MPapatriantafyllopoulou, CIqbal, J Identification of novel chromone based sulfonamides as highly potent and selective inhibitors of alkaline phosphatases. Eur J Med Chem66:438-49 (2013) 
 
Intestinal-type alkaline phosphatase
Name:Intestinal-type alkaline phosphatase
Type:Protein
Mol. Mass.:57094.82
Organism:Bos taurus (Cattle)
Description:P19111
Residue:533
BDBM50437936
NameBDBM50437936
Synonyms:CHEMBL2408700
TypeSmall organic molecule
Emp. Form.C16H11FN2O4S
Mol. Mass.346.333
SMILESFc1ccc2occ(C3Nc4ccccc4S(=O)(=O)N3)c(=O)c2c1