Reaction Details
TargetIntestinal-type alkaline phosphatase
LigandBDBM50437941
Substrate/Competitorn/a
Meas. Tech.ChEMBL_972808 (CHEMBL2411276)
Ki 17100±n/a nM
Citation al-Rashida, MRaza, RAbbas, GShah, MSKostakis, GELecka, JSévigny, JMuddassar, MPapatriantafyllopoulou, CIqbal, J Identification of novel chromone based sulfonamides as highly potent and selective inhibitors of alkaline phosphatases. Eur J Med Chem66:438-49 (2013) 
 
Intestinal-type alkaline phosphatase
Name:Intestinal-type alkaline phosphatase
Type:Protein
Mol. Mass.:57094.82
Organism:Bos taurus (Cattle)
Description:P19111
Residue:533
BDBM50437941
NameBDBM50437941
Synonyms:CHEMBL1814397
TypeSmall organic molecule
Emp. Form.C18H17FN2O5S
Mol. Mass.392.401
SMILESCCOC1Oc2ccc(F)cc2C(=O)C1=CNc1cccc(c1)S(N)(=O)=O