Reaction Details
TargetPapain
LigandBDBM50437951
Substrate/Competitorn/a
Meas. Tech.ChEMBL_972846 (CHEMBL2411623)
Ki 1620±n/a nM
Citation Schiefer, ITTapadar, SLitosh, VSiklos, MScism, RWijewickrama, GTChandrasena, EPSinha, VTavassoli, EBrunsteiner, MFa', MArancio, OPetukhov, PThatcher, GR Design, synthesis, and optimization of novel epoxide incorporating peptidomimetics as selective calpain inhibitors. J Med Chem56:6054-68 (2013) 
 
Papain
Name:Papain
Type:Enzyme
Mol. Mass.:38923.01
Organism:Carica papaya
Description:Papain was purchased from Sigma, Germany.
Residue:345
BDBM50437951
NameBDBM50437951
Synonyms:CHEMBL2408922 | US9403843, 24a
TypeSmall organic molecule
Emp. Form.C19H20FN3O5S
Mol. Mass.421.443
SMILESCC(C)C[C@H](NC(=O)[C@H]1O[C@@H]1C(O)=O)C(=O)Nc1nc(cs1)-c1ccc(F)cc1