Reaction Details
TargetCalpain-1 catalytic subunit
LigandBDBM50437949
Substrate/Competitorn/a
Meas. Tech.ChEMBL_972847 (CHEMBL2411624)
Ki 3530±n/a nM
Citation Schiefer, ITTapadar, SLitosh, VSiklos, MScism, RWijewickrama, GTChandrasena, EPSinha, VTavassoli, EBrunsteiner, MFa', MArancio, OPetukhov, PThatcher, GR Design, synthesis, and optimization of novel epoxide incorporating peptidomimetics as selective calpain inhibitors. J Med Chem56:6054-68 (2013) 
 
Calpain-1 catalytic subunit
Name:Calpain-1 catalytic subunit
Type:Catalytic subunit; forms a heterodimer with a small (regulatory) subunit (CAPNS1)
Mol. Mass.:81729.82
Organism:Sus scrofa (pig)
Description:Native calpain-1 from porcine erythrocytes, purchased from Calbiochem, was used in assay.
Residue:714
BDBM50437949
NameBDBM50437949
Synonyms:CHEMBL2408918 | US9403843, 34
TypeSmall organic molecule
Emp. Form.C21H16N4O5S2
Mol. Mass.468.506
SMILESOC(=O)[C@H]1O[C@@H]1C(=O)N[C@@H](Cc1cscn1)C(=O)Nc1nc(cs1)-c1ccc(cc1)C#C