Reaction Details
TargetG protein-activated inward rectifier potassium channel 1
LigandBDBM50437962
Substrate/Competitorn/a
Meas. Tech.ChEMBL_972869 (CHEMBL2411646)
IC50 850±n/a nM
Citation Wen, WWu, WRomaine, IMKaufmann, KDu, YSulikowski, GAWeaver, CDLindsley, CW Discovery of 'molecular switches' within a GIRK activator scaffold that afford selective GIRK inhibitors. Bioorg Med Chem Lett23:4562-6 (2013) 
 
G protein-activated inward rectifier potassium channel 1
Name:G protein-activated inward rectifier potassium channel 1
Type:PROTEIN
Mol. Mass.:56610.74
Organism:Homo sapiens (Human)
Description:ChEMBL_107915
Residue:501
BDBM50437962
NameBDBM50437962
Synonyms:CHEMBL2409119
TypeSmall organic molecule
Emp. Form.C20H20N4O
Mol. Mass.332.399
SMILESCc1cccc(NC(=O)Nc2cc(nn2-c2ccccc2)C2CC2)c1