Reaction Details
TargetG protein-activated inward rectifier potassium channel 1
LigandBDBM50437967
Substrate/Competitorn/a
Meas. Tech.ChEMBL_972869 (CHEMBL2411646)
IC50 30000±n/a nM
Citation Wen, WWu, WRomaine, IMKaufmann, KDu, YSulikowski, GAWeaver, CDLindsley, CW Discovery of 'molecular switches' within a GIRK activator scaffold that afford selective GIRK inhibitors. Bioorg Med Chem Lett23:4562-6 (2013) 
 
G protein-activated inward rectifier potassium channel 1
Name:G protein-activated inward rectifier potassium channel 1
Type:PROTEIN
Mol. Mass.:56610.74
Organism:Homo sapiens (Human)
Description:ChEMBL_107915
Residue:501
BDBM50437967
NameBDBM50437967
Synonyms:CHEMBL2409112
TypeSmall organic molecule
Emp. Form.C22H16F2N4O
Mol. Mass.390.3854
SMILESFc1ccc(NC(=O)Nc2cc(nn2-c2ccccc2)-c2ccccc2)cc1F