Reaction Details
TargetG protein-activated inward rectifier potassium channel 4
LigandBDBM50437970
Substrate/Competitorn/a
Meas. Tech.ChEMBL_972874 (CHEMBL2411651)
EC50 320±n/a nM
Citation Wen, WWu, WRomaine, IMKaufmann, KDu, YSulikowski, GAWeaver, CDLindsley, CW Discovery of 'molecular switches' within a GIRK activator scaffold that afford selective GIRK inhibitors. Bioorg Med Chem Lett23:4562-6 (2013) 
 
G protein-activated inward rectifier potassium channel 4
Name:G protein-activated inward rectifier potassium channel 4
Type:PROTEIN
Mol. Mass.:47658.06
Organism:Homo sapiens (Human)
Description:ChEMBL_107914
Residue:419
BDBM50437970
NameBDBM50437970
Synonyms:CHEMBL2409132
TypeSmall organic molecule
Emp. Form.C20H18ClFN4O
Mol. Mass.384.835
SMILESFc1ccc(NC(=O)Nc2cc(nn2Cc2ccccc2)C2CC2)cc1Cl