Reaction Details
TargetG protein-activated inward rectifier potassium channel 4
LigandBDBM50437983
Substrate/Competitorn/a
Meas. Tech.ChEMBL_972874 (CHEMBL2411651)
EC50 1800±n/a nM
Citation Wen, WWu, WRomaine, IMKaufmann, KDu, YSulikowski, GAWeaver, CDLindsley, CW Discovery of 'molecular switches' within a GIRK activator scaffold that afford selective GIRK inhibitors. Bioorg Med Chem Lett23:4562-6 (2013) 
 
G protein-activated inward rectifier potassium channel 4
Name:G protein-activated inward rectifier potassium channel 4
Type:PROTEIN
Mol. Mass.:47658.06
Organism:Homo sapiens (Human)
Description:ChEMBL_107914
Residue:419
BDBM50437983
NameBDBM50437983
Synonyms:CHEMBL2409106
TypeSmall organic molecule
Emp. Form.C17H14F2N4O
Mol. Mass.328.3161
SMILESCc1cc(NC(=O)Nc2ccc(F)c(F)c2)n(n1)-c1ccccc1