Reaction Details
TargetG protein-activated inward rectifier potassium channel 1
LigandBDBM50437972
Substrate/Competitorn/a
Meas. Tech.ChEMBL_972866 (CHEMBL2411643)
EC50 570±n/a nM
Citation Wen, WWu, WRomaine, IMKaufmann, KDu, YSulikowski, GAWeaver, CDLindsley, CW Discovery of 'molecular switches' within a GIRK activator scaffold that afford selective GIRK inhibitors. Bioorg Med Chem Lett23:4562-6 (2013) 
 
G protein-activated inward rectifier potassium channel 1
Name:G protein-activated inward rectifier potassium channel 1
Type:PROTEIN
Mol. Mass.:56610.74
Organism:Homo sapiens (Human)
Description:ChEMBL_107915
Residue:501
BDBM50437972
NameBDBM50437972
Synonyms:CHEMBL2409130
TypeSmall organic molecule
Emp. Form.C21H22N4O
Mol. Mass.346.4256
SMILESCc1ccc(NC(=O)Nc2cc(nn2Cc2ccccc2)C2CC2)cc1