Reaction Details
TargetG protein-activated inward rectifier potassium channel 1
LigandBDBM50437973
Substrate/Competitorn/a
Meas. Tech.ChEMBL_972866 (CHEMBL2411643)
EC50 380±n/a nM
Citation Wen, WWu, WRomaine, IMKaufmann, KDu, YSulikowski, GAWeaver, CDLindsley, CW Discovery of 'molecular switches' within a GIRK activator scaffold that afford selective GIRK inhibitors. Bioorg Med Chem Lett23:4562-6 (2013) 
 
G protein-activated inward rectifier potassium channel 1
Name:G protein-activated inward rectifier potassium channel 1
Type:PROTEIN
Mol. Mass.:56610.74
Organism:Homo sapiens (Human)
Description:ChEMBL_107915
Residue:501
BDBM50437973
NameBDBM50437973
Synonyms:CHEMBL2409129
TypeSmall organic molecule
Emp. Form.C20H19BrN4O
Mol. Mass.411.295
SMILESBrc1cccc(NC(=O)Nc2cc(nn2Cc2ccccc2)C2CC2)c1