Reaction Details
TargetG protein-activated inward rectifier potassium channel 1
LigandBDBM50437978
Substrate/Competitorn/a
Meas. Tech.ChEMBL_972866 (CHEMBL2411643)
EC50>10000±n/a nM
Citation Wen, WWu, WRomaine, IMKaufmann, KDu, YSulikowski, GAWeaver, CDLindsley, CW Discovery of 'molecular switches' within a GIRK activator scaffold that afford selective GIRK inhibitors. Bioorg Med Chem Lett23:4562-6 (2013) 
 
G protein-activated inward rectifier potassium channel 1
Name:G protein-activated inward rectifier potassium channel 1
Type:PROTEIN
Mol. Mass.:56610.74
Organism:Homo sapiens (Human)
Description:ChEMBL_107915
Residue:501
BDBM50437978
NameBDBM50437978
Synonyms:CHEMBL2409111
TypeSmall organic molecule
Emp. Form.C16H13F2N5O
Mol. Mass.329.3041
SMILESCc1cc(NC(=O)Nc2ccc(F)c(F)c2)n(n1)-c1ccncc1