Reaction Details
TargetG protein-activated inward rectifier potassium channel 4
LigandBDBM50437961
Substrate/Competitorn/a
Meas. Tech.ChEMBL_972867 (CHEMBL2411644)
IC50>30000±n/a nM
Citation Wen, WWu, WRomaine, IMKaufmann, KDu, YSulikowski, GAWeaver, CDLindsley, CW Discovery of 'molecular switches' within a GIRK activator scaffold that afford selective GIRK inhibitors. Bioorg Med Chem Lett23:4562-6 (2013) 
 
G protein-activated inward rectifier potassium channel 4
Name:G protein-activated inward rectifier potassium channel 4
Type:PROTEIN
Mol. Mass.:47658.06
Organism:Homo sapiens (Human)
Description:ChEMBL_107914
Residue:419
BDBM50437961
NameBDBM50437961
Synonyms:CHEMBL2409121
TypeSmall organic molecule
Emp. Form.C19H17FN4O
Mol. Mass.336.3629
SMILESFc1cccc(NC(=O)Nc2cc(nn2-c2ccccc2)C2CC2)c1