Reaction Details
TargetG protein-activated inward rectifier potassium channel 4
LigandBDBM50437965
Substrate/Competitorn/a
Meas. Tech.ChEMBL_972867 (CHEMBL2411644)
IC50 30000±n/a nM
Citation Wen, WWu, WRomaine, IMKaufmann, KDu, YSulikowski, GAWeaver, CDLindsley, CW Discovery of 'molecular switches' within a GIRK activator scaffold that afford selective GIRK inhibitors. Bioorg Med Chem Lett23:4562-6 (2013) 
 
G protein-activated inward rectifier potassium channel 4
Name:G protein-activated inward rectifier potassium channel 4
Type:PROTEIN
Mol. Mass.:47658.06
Organism:Homo sapiens (Human)
Description:ChEMBL_107914
Residue:419
BDBM50437965
NameBDBM50437965
Synonyms:CHEMBL2409115
TypeSmall organic molecule
Emp. Form.C20H18F2N4O
Mol. Mass.368.3799
SMILESFc1ccc(NC(=O)Nc2cc(nn2-c2ccccc2)C2CCC2)cc1F