Reaction Details
TargetSphingosine kinase 1
LigandBDBM50438126
Substrate/Competitorn/a
Meas. Tech.ChEMBL_972986 (CHEMBL2412224)
IC50 5.0±n/a nM
Citation Gustin, DJLi, YBrown, MLMin, XSchmitt, MJWanska, MWang, XConnors, RJohnstone, SCardozo, MCheng, ACJeffries, SFranks, BLi, SShen, SWong, MWesche, HXu, GCarlson, TJPlant, MMorgenstern, KRex, KSchmitt, JCoxon, AWalker, NKayser, FWang, Z Structure guided design of a series of sphingosine kinase (SphK) inhibitors. Bioorg Med Chem Lett23:4608-16 (2013) 
 
Sphingosine kinase 1
Name:Sphingosine kinase 1
Type:Enzyme
Mol. Mass.:42521.16
Organism:Homo sapiens (Human)
Description:Q9NYA1
Residue:384
BDBM50438126
NameBDBM50438126
Synonyms:CHEMBL2407197
TypeSmall organic molecule
Emp. Form.C27H37N3O2S
Mol. Mass.467.667
SMILESOC[C@H]1C[C@@H](O)CCN1CCc1ccc(Nc2nc(cs2)C23CC4CC(CC(C4)C2)C3)cc1