Reaction Details
TargetKallikrein-5 [D153N]
LigandBDBM32709
Substrate/Competitorn/a
Meas. Tech.ChEMBL_973058 (CHEMBL2412639)
Ki 4400±n/a nM
Citation Tan, XFurio, LReboud-Ravaux, MVilloutreix, BOHovnanian, AEl Amri, C 1,2,4-Triazole derivatives as transient inactivators of kallikreins involved in skin diseases. Bioorg Med Chem Lett23:4547-51 (2013) 
 
Kallikrein-5 [D153N]
Name:Kallikrein-5 [D153N]
Type:PROTEIN
Mol. Mass.:32031.75
Organism:Homo sapiens (Human)
Description:ChEMBL_1282456
Residue:293
BDBM32709
NameBDBM32709
Synonyms:(5-amino-3-pyridin-3-yl-1,2,4-triazol-1-yl)-(4-methylphenyl)methanone 1-(4-methylbenzoyl)-3-(3-pyridinyl)-1H-1,2,4-triazol-5-amine SMR000144080 [5-amino-3-(3-pyridyl)-1,2,4-triazol-1-yl]-(p-tolyl)methanone | cid_970375
TypeSmall organic molecule
Emp. Form.C15H13N5O
Mol. Mass.279.2966
SMILESCc1ccc(cc1)C(=O)n1nc(nc1N)-c1cccnc1