Reaction Details
TargetKallikrein-7
LigandBDBM33437
Substrate/Competitorn/a
Meas. Tech.ChEMBL_973068 (CHEMBL2412649)
IC50 230±n/a nM
Citation Tan, XFurio, LReboud-Ravaux, MVilloutreix, BOHovnanian, AEl Amri, C 1,2,4-Triazole derivatives as transient inactivators of kallikreins involved in skin diseases. Bioorg Med Chem Lett23:4547-51 (2013) 
 
Kallikrein-7
Name:Kallikrein-7
Type:PROTEIN
Mol. Mass.:27535.05
Organism:Homo sapiens (Human)
Description:ChEMBL_1469257
Residue:253
BDBM33437
NameBDBM33437
Synonyms:(5-amino-3-phenyl-1,2,4-triazol-1-yl)-(3,4-dimethoxyphenyl)methanone 1-(3,4-dimethoxybenzoyl)-3-phenyl-1H-1,2,4-triazol-5-amine SMR000074479 | cid_975107
TypeSmall organic molecule
Emp. Form.C17H16N4O3
Mol. Mass.324.3339
SMILESCOc1ccc(cc1OC)C(=O)n1nc(nc1N)-c1ccccc1