Reaction Details
TargetKallikrein-7
LigandBDBM33882
Substrate/Competitorn/a
Meas. Tech.ChEMBL_973068 (CHEMBL2412649)
IC50 220±n/a nM
Citation Tan, XFurio, LReboud-Ravaux, MVilloutreix, BOHovnanian, AEl Amri, C 1,2,4-Triazole derivatives as transient inactivators of kallikreins involved in skin diseases. Bioorg Med Chem Lett23:4547-51 (2013) 
 
Kallikrein-7
Name:Kallikrein-7
Type:PROTEIN
Mol. Mass.:27535.05
Organism:Homo sapiens (Human)
Description:ChEMBL_1469257
Residue:253
BDBM33882
NameBDBM33882
Synonyms:(5-amino-3-pyridin-3-yl-1,2,4-triazol-1-yl)-(4-chlorophenyl)methanone 1-(4-chlorobenzoyl)-3-pyridin-3-yl-1H-1,2,4-triazol-5-amine SMR000306508 [5-amino-3-(3-pyridyl)-1,2,4-triazol-1-yl]-(4-chlorophenyl)methanone | cid_5000438
TypeSmall organic molecule
Emp. Form.C14H10ClN5O
Mol. Mass.299.715
SMILESNc1nc(nn1C(=O)c1ccc(Cl)cc1)-c1cccnc1