Reaction Details
TargetPoly [ADP-ribose] polymerase 1
LigandBDBM27135
Substrate/Competitorn/a
Meas. Tech.ChEMBL_973098 (CHEMBL2412861)
EC50 160000±n/a nM
Citation Gangloff, ARBrown, Jde Jong, RDougan, DRGrimshaw, CEHixon, MJennings, AKamran, RKiryanov, AO'Connell, STaylor, EVu, P Discovery of novel benzo[b][1,4]oxazin-3(4H)-ones as poly(ADP-ribose)polymerase inhibitors. Bioorg Med Chem Lett23:4501-5 (2013) 
 
Poly [ADP-ribose] polymerase 1
Name:Poly [ADP-ribose] polymerase 1
Type:n/a
Mol. Mass.:113114.22
Organism:Homo sapiens (Human)
Description:P09874
Residue:1014
BDBM27135
NameBDBM27135
Synonyms:2-[(2R)-2-methylpyrrolidin-2-yl]-1H-1,3-benzodiazole-4-carboxamide benzimidazole carboxamide, 3a
TypeSmall organic molecule
Emp. Form.C13H16N4O
Mol. Mass.244.2923
SMILESC[C@@]1(CCCN1)c1nc2cccc(C(N)=O)c2[nH]1