Reaction Details
TargetCalmodulin
LigandBDBM50438364
Substrate/Competitorn/a
Meas. Tech.ChEMBL_973580 (CHEMBL2411138)
Kd 19±n/a nM
Citation Madariaga-Mazón, AGonzález-Andrade, MGonzález, Mdel CGlenn, AECerda-García-Rojas, CMMata, R Absolute configuration of acremoxanthone C, a potent calmodulin inhibitor from Purpureocillium lilacinum. J Nat Prod76:1454-60 (2013) 
 
Calmodulin
Name:Calmodulin
Type:PROTEIN
Mol. Mass.:16813.73
Organism:Bos taurus
Description:ChEMBL_1458985
Residue:149
BDBM50438364
NameBDBM50438364
Synonyms:CHEMBL2408939
TypeSmall organic molecule
Emp. Form.C33H26O12
Mol. Mass.614.5523
SMILESCOC(=O)c1c(O)ccc(O)c1C(=O)c1c(O)cc2C[C@@]34CC=C(C(=O)C3C(=O)c3c(O)cc(C)cc3[C@@H]4OC(C)=O)c2c1O