Reaction Details
TargetAdenosine receptor A1
LigandBDBM50438369
Substrate/Competitorn/a
Meas. Tech.ChEMBL_976686 (CHEMBL2417092)
Ki 9.3±n/a nM
Citation Kozma, EJayasekara, PSSquarcialupi, LPaoletta, SMoro, SFederico, SSpalluto, GJacobson, KA Fluorescent ligands for adenosine receptors. Bioorg Med Chem Lett23:26-36 (2012) 
 
Adenosine receptor A1
Name:Adenosine receptor A1
Type:Enzyme Catalytic Domain
Mol. Mass.:36602.99
Organism:BOVINE
Description:ADENOSINE 0 BOVINE::P28190
Residue:326
BDBM50438369
NameBDBM50438369
Synonyms:CHEMBL2413238
TypeSmall organic molecule
Emp. Form.C42H43N7O9S
Mol. Mass.821.897
SMILESCCCn1c2NC(Nc2c(=O)n(CCC)c1=O)c1ccc(OCC(=O)NCCNC(=S)Nc2ccc(C3C4C=CC(=O)C=C4Oc4cc(O)ccc34)c(c2)C(O)=O)cc1