Reaction Details
TargetAngiotensin-converting enzyme
LigandBDBM50021153
Substrate/Competitorn/a
Meas. Tech.ChEMBL_975642 (CHEMBL2416126)
IC50 212±n/a nM
Citation Addla, DJallapally, AKanwal, ASridhar, BBanerjee, SKKantevari, S Design, synthesis and evaluation of novel 2-hydroxypyrrolobenzodiazepine-5,11-dione analogues as potent angiotensin converting enzyme (ACE) inhibitors. Bioorg Med Chem21:4485-93 (2013) 
 
Angiotensin-converting enzyme
Name:Angiotensin-converting enzyme
Type:n/a
Mol. Mass.:150405.15
Organism:Oryctolagus cuniculus
Description:n/a
Residue:1310
BDBM50021153
NameBDBM50021153
Synonyms:1H-1-Benzazepine-1-acetic acid, 3-((1-(ethoxycarbonyl)-3-phenylpropyl)amino)-2,3,4,5-tetrahydro-2-oxo-, (S-(R*,R*))- CHEMBL838 | [(3S)-3-{[(1S)-1-(ethoxycarbonyl)-3-phenylpropyl]amino}-2-oxo-2,3,4,5-tetrahydro-1H-1-benzazepin-1-yl]acetic acid
TypeSmall organic molecule
Emp. Form.C24H28N2O5
Mol. Mass.424.4895
SMILESCCOC(=O)[C@H](CCc1ccccc1)N[C@H]1CCc2ccccc2N(CC(O)=O)C1=O