Reaction Details
TargetAngiotensin-converting enzyme
LigandBDBM50438379
Substrate/Competitorn/a
Meas. Tech.ChEMBL_975642 (CHEMBL2416126)
IC50 272±n/a nM
Citation Addla, DJallapally, AKanwal, ASridhar, BBanerjee, SKKantevari, S Design, synthesis and evaluation of novel 2-hydroxypyrrolobenzodiazepine-5,11-dione analogues as potent angiotensin converting enzyme (ACE) inhibitors. Bioorg Med Chem21:4485-93 (2013) 
 
Angiotensin-converting enzyme
Name:Angiotensin-converting enzyme
Type:n/a
Mol. Mass.:150405.15
Organism:Oryctolagus cuniculus
Description:n/a
Residue:1310
BDBM50438379
NameBDBM50438379
Synonyms:CHEMBL2413588
TypeSmall organic molecule
Emp. Form.C17H15BrN2O3S
Mol. Mass.407.282
SMILESO[C@@H]1C[C@@H]2N(C1)C(=O)c1ccccc1N(Cc1cc(Br)cs1)C2=O