Reaction Details
TargetRibonuclease pancreatic
LigandBDBM50438448
Substrate/Competitorn/a
Meas. Tech.ChEMBL_975987 (CHEMBL2415636)
Ki 140000±n/a nM
Citation Datta, DSamanta, ADasgupta, SPathak, T 3'-Oxo-, amino-, thio- and sulfone-acetic acid modified thymidines: effect of increased acidity on ribonuclease A inhibition. Bioorg Med Chem21:4634-45 (2013) 
 
Ribonuclease pancreatic
Name:Ribonuclease pancreatic
Type:Enzyme
Mol. Mass.:16468.79
Organism:Bison bison (American bison)
Description:carboxamidomethylated RNase A
Residue:150
BDBM50438448
NameBDBM50438448
Synonyms:CHEMBL2414513
TypeSmall organic molecule
Emp. Form.C13H18N2O8S
Mol. Mass.362.356
SMILESCOC(=O)CS(=O)(=O)[C@H]1C[C@@H](O[C@@H]1CO)n1cc(C)c(=O)[nH]c1=O