Reaction Details
TargetRibonuclease pancreatic
LigandBDBM50438456
Substrate/Competitorn/a
Meas. Tech.ChEMBL_975987 (CHEMBL2415636)
Ki 88000±n/a nM
Citation Datta, DSamanta, ADasgupta, SPathak, T 3'-Oxo-, amino-, thio- and sulfone-acetic acid modified thymidines: effect of increased acidity on ribonuclease A inhibition. Bioorg Med Chem21:4634-45 (2013) 
 
Ribonuclease pancreatic
Name:Ribonuclease pancreatic
Type:Enzyme
Mol. Mass.:16468.79
Organism:Bison bison (American bison)
Description:carboxamidomethylated RNase A
Residue:150
BDBM50438456
NameBDBM50438456
Synonyms:CHEMBL2414521
TypeSmall organic molecule
Emp. Form.C12H16N2O8S
Mol. Mass.348.329
SMILESCc1cn([C@H]2C[C@@H]([C@@H](CO)O2)S(=O)(=O)CC(O)=O)c(=O)[nH]c1=O