Reaction Details
TargetHypoxanthine-guanine phosphoribosyltransferase
LigandBDBM50438473
Substrate/Competitorn/a
Meas. Tech.ChEMBL_976205 (CHEMBL2415854)
Ki>10000±n/a nM
Citation Clinch, KCrump, DREvans, GBHazleton, KZMason, JMSchramm, VLTyler, PC Acyclic phosph(on)ate inhibitors of Plasmodium falciparum hypoxanthine-guanine-xanthine phosphoribosyltransferase. Bioorg Med Chem21:5629-46 (2013) 
 
Hypoxanthine-guanine phosphoribosyltransferase
Name:Hypoxanthine-guanine phosphoribosyltransferase
Type:Protein
Mol. Mass.:24579.61
Organism:Homo sapiens (Human)
Description:P00492
Residue:218
BDBM50438473
NameBDBM50438473
Synonyms:CHEMBL2414643
TypeSmall organic molecule
Emp. Form.C10H14ClN4O6P
Mol. Mass.352.668
SMILESOCC(COP(O)(O)=O)NCc1c[nH]c2c1nc(Cl)[nH]c2=O