Reaction Details
TargetOligo-1,6-glucosidase IMA1
LigandBDBM50438504
Substrate/Competitorn/a
Meas. Tech.ChEMBL_976222 (CHEMBL2415107)
IC50 2300±n/a nM
Citation Bian, XFan, XKe, CLuan, YZhao, GZeng, A Synthesis anda-glucosidase inhibitory activity evaluation of N-substituted aminomethyl-ß-d-glucopyranosides. Bioorg Med Chem21:5442-50 (2013) 
 
Oligo-1,6-glucosidase IMA1
Name:Oligo-1,6-glucosidase IMA1
Type:Protein
Mol. Mass.:68577.59
Organism:Saccharomyces cerevisiae S288c (Baker's yeast)
Description:n/a
Residue:589
BDBM50438504
NameBDBM50438504
Synonyms:CHEMBL2414818
TypeSmall organic molecule
Emp. Form.C16H21NO6
Mol. Mass.323.341
SMILESOC[C@H]1O[C@@H](CNC(=O)\C=C\c2ccccc2)[C@H](O)[C@@H](O)[C@@H]1O