Reaction Details
TargetCentromere-associated protein E
LigandBDBM50438554
Substrate/Competitorn/a
Meas. Tech.ChEMBL_976960 (CHEMBL2416484)
IC50 35±n/a nM
Citation Hirayama, TOkaniwa, MImada, TOhashi, AOhori, MIwai, KMori, KKawamoto, TYokota, ATanaka, TIshikawa, T Synthetic studies of centromere-associated protein-E (CENP-E) inhibitors: 1.Exploration of fused bicyclic core scaffolds using electrostatic potential map. Bioorg Med Chem21:5488-502 (2013) 
 
Centromere-associated protein E
Name:Centromere-associated protein E
Type:PROTEIN
Mol. Mass.:316360.15
Organism:Homo sapiens (Human)
Description:ChEMBL_976960
Residue:2701
BDBM50438554
NameBDBM50438554
Synonyms:CHEMBL2413143
TypeSmall organic molecule
Emp. Form.C24H21Cl3FN3OS
Mol. Mass.524.865
SMILESCN(C)CCN(Cc1ccc(Cl)c(Cl)c1)C(=O)c1cc2scc(Cl)c2n1-c1ccc(F)cc1