Reaction Details
TargetCentromere-associated protein E
LigandBDBM50438560
Substrate/Competitorn/a
Meas. Tech.ChEMBL_976960 (CHEMBL2416484)
IC50 100±n/a nM
Citation Hirayama, TOkaniwa, MImada, TOhashi, AOhori, MIwai, KMori, KKawamoto, TYokota, ATanaka, TIshikawa, T Synthetic studies of centromere-associated protein-E (CENP-E) inhibitors: 1.Exploration of fused bicyclic core scaffolds using electrostatic potential map. Bioorg Med Chem21:5488-502 (2013) 
 
Centromere-associated protein E
Name:Centromere-associated protein E
Type:PROTEIN
Mol. Mass.:316360.15
Organism:Homo sapiens (Human)
Description:ChEMBL_976960
Residue:2701
BDBM50438560
NameBDBM50438560
Synonyms:CHEMBL2413137
TypeSmall organic molecule
Emp. Form.C26H24Cl2FN3O2S
Mol. Mass.532.457
SMILESCN(C)CCN(Cc1ccc(Cl)c(Cl)c1)C(=O)c1c(-c2ccc(F)cc2)c2cscc2c(=O)n1C