Reaction Details
TargetPoly [ADP-ribose] polymerase 2
LigandBDBM27503
Substrate/Competitorn/a
Meas. Tech.ChEMBL_975899 (CHEMBL2415548)
IC50 1050±n/a nM
Citation Woon, ECSunderland, PTPaine, HALloyd, MDThompson, ASThreadgill, MD One-pot tandem Hurtley-retro-Claisen-cyclisation reactions in the synthesis of 3-substituted analogues of 5-aminoisoquinolin-1-one (5-AIQ), a water-soluble inhibitor of PARPs. Bioorg Med Chem21:5218-27 (2013) 
 
Poly [ADP-ribose] polymerase 2
Name:Poly [ADP-ribose] polymerase 2
Type:n/a
Mol. Mass.:63409.97
Organism:Mus musculus (Mouse)
Description:Alexis Biochemicals, Cat. no. ALX-201-064-C020
Residue:559
BDBM27503
NameBDBM27503
Synonyms:5-AIQ 5-aminoisoquinolin-1(2H)-one | CHEMBL446240
TypeSmall organic molecule
Emp. Form.C9H8N2O
Mol. Mass.160.1726
SMILESNc1cccc2c1cc[nH]c2=O