Reaction Details
TargetPoly [ADP-ribose] polymerase 1
LigandBDBM50438605
Substrate/Competitorn/a
Meas. Tech.ChEMBL_975900 (CHEMBL2415549)
IC50 330±n/a nM
Citation Woon, ECSunderland, PTPaine, HALloyd, MDThompson, ASThreadgill, MD One-pot tandem Hurtley-retro-Claisen-cyclisation reactions in the synthesis of 3-substituted analogues of 5-aminoisoquinolin-1-one (5-AIQ), a water-soluble inhibitor of PARPs. Bioorg Med Chem21:5218-27 (2013) 
 
Poly [ADP-ribose] polymerase 1
Name:Poly [ADP-ribose] polymerase 1
Type:n/a
Mol. Mass.:113114.22
Organism:Homo sapiens (Human)
Description:P09874
Residue:1014
BDBM50438605
NameBDBM50438605
Synonyms:CHEMBL2414042
TypeSmall organic molecule
Emp. Form.C16H11F3N2O
Mol. Mass.304.2665
SMILESNc1cccc2c1cc([nH]c2=O)-c1ccc(cc1)C(F)(F)F