Reaction Details
TargetPhosphatidylinositol 4,5-bisphosphate 3-kinase catalytic subunit delta isoform
LigandBDBM50403074
Substrate/Competitorn/a
Meas. Tech.ChEMBL_976067 (CHEMBL2415716)
IC50 12±n/a nM
Citation Safina, BSSweeney, ZKLi, JChan, BKBisconte, ACarrera, DCastanedo, GFlagella, MHeald, RLewis, CMurray, JMNonomiya, JPang, JPrice, SReif, KSalphati, LSeward, EMWei, BSutherlin, DP Identification of GNE-293, a potent and selective PI3Kd inhibitor: navigating in vitro genotoxicity while improving potency and selectivity. Bioorg Med Chem Lett23:4953-9 (2013) 
 
Phosphatidylinositol 4,5-bisphosphate 3-kinase catalytic subunit delta isoform
Name:Phosphatidylinositol 4,5-bisphosphate 3-kinase catalytic subunit delta isoform
Type:Enzyme Subunit
Mol. Mass.:119489.41
Organism:Homo sapiens (Human)
Description:O00329
Residue:1044
BDBM50403074
NameBDBM50403074
Synonyms:CHEMBL2216903
TypeSmall organic molecule
Emp. Form.C26H32N8O3
Mol. Mass.504.5841
SMILESCCc1nc2ccccc2n1-c1nc(N2CCOCC2)c2nc(OC3CN(C3)C(=O)C(C)C)n(C)c2n1