Reaction Details
TargetPhosphatidylinositol 4,5-bisphosphate 3-kinase catalytic subunit delta isoform
LigandBDBM50438636
Substrate/Competitorn/a
Meas. Tech.ChEMBL_976122 (CHEMBL2415771)
Ki 2.3±n/a nM
Citation Safina, BSSweeney, ZKLi, JChan, BKBisconte, ACarrera, DCastanedo, GFlagella, MHeald, RLewis, CMurray, JMNonomiya, JPang, JPrice, SReif, KSalphati, LSeward, EMWei, BSutherlin, DP Identification of GNE-293, a potent and selective PI3Kd inhibitor: navigating in vitro genotoxicity while improving potency and selectivity. Bioorg Med Chem Lett23:4953-9 (2013) 
 
Phosphatidylinositol 4,5-bisphosphate 3-kinase catalytic subunit delta isoform
Name:Phosphatidylinositol 4,5-bisphosphate 3-kinase catalytic subunit delta isoform
Type:Enzyme Subunit
Mol. Mass.:119489.41
Organism:Homo sapiens (Human)
Description:O00329
Residue:1044
BDBM50438636
NameBDBM50438636
Synonyms:CHEMBL2414239
TypeSmall organic molecule
Emp. Form.C26H34N8O2
Mol. Mass.490.6006
SMILESCn1c(CN2CCC(CC2)C(C)(C)O)nc2c(nc(nc12)-c1cccc2[nH]ncc12)N1CCOCC1