Reaction Details
TargetPhosphatidylinositol 4,5-bisphosphate 3-kinase catalytic subunit delta isoform
LigandBDBM50438637
Substrate/Competitorn/a
Meas. Tech.ChEMBL_976122 (CHEMBL2415771)
Ki 1.1±n/a nM
Citation Safina, BSSweeney, ZKLi, JChan, BKBisconte, ACarrera, DCastanedo, GFlagella, MHeald, RLewis, CMurray, JMNonomiya, JPang, JPrice, SReif, KSalphati, LSeward, EMWei, BSutherlin, DP Identification of GNE-293, a potent and selective PI3Kd inhibitor: navigating in vitro genotoxicity while improving potency and selectivity. Bioorg Med Chem Lett23:4953-9 (2013) 
 
Phosphatidylinositol 4,5-bisphosphate 3-kinase catalytic subunit delta isoform
Name:Phosphatidylinositol 4,5-bisphosphate 3-kinase catalytic subunit delta isoform
Type:Enzyme Subunit
Mol. Mass.:119489.41
Organism:Homo sapiens (Human)
Description:O00329
Residue:1044
BDBM50438637
NameBDBM50438637
Synonyms:CHEMBL2414238
TypeSmall organic molecule
Emp. Form.C26H32N6O2S
Mol. Mass.492.636
SMILESCC(C)(O)C1CCN(Cc2cc3nc(nc(N4CCOCC4)c3s2)-c2cccc3[nH]ncc23)CC1