Reaction Details
TargetNitric oxide synthase, endothelial
LigandBDBM50438645
Substrate/Competitorn/a
Meas. Tech.ChEMBL_976154 (CHEMBL2415803)
Ki 2154±n/a nM
Citation Jing, QLi, HFang, JRoman, LJMartásek, PPoulos, TLSilverman, RB In search of potent and selective inhibitors of neuronal nitric oxide synthase with more simple structures. Bioorg Med Chem21:5323-31 (2013) 
 
Nitric oxide synthase, endothelial
Name:Nitric oxide synthase, endothelial
Type:Enzyme
Mol. Mass.:133292.26
Organism:Bos taurus (bovine)
Description:Recombinant eNOS overexpressed in E. coli was used in enzyme assays.
Residue:1205
BDBM50438645
NameBDBM50438645
Synonyms:CHEMBL2414428
TypeSmall organic molecule
Emp. Form.C19H28N4
Mol. Mass.312.4524
SMILESCc1cc(N)nc(CCCCCCCc2cc(C)cc(N)n2)c1