Reaction Details
TargetHeme oxygenase 1
LigandBDBM50438651
Substrate/Competitorn/a
Meas. Tech.ChEMBL_976175 (CHEMBL2415824)
IC50 1000±n/a nM
Citation Salerno, LPittalà, VRomeo, GModica, MNSiracusa, MADi Giacomo, CAcquaviva, RBarbagallo, ITibullo, DSorrenti, V Evaluation of novel aryloxyalkyl derivatives of imidazole and 1,2,4-triazole as heme oxygenase-1 (HO-1) inhibitors and their antitumor properties. Bioorg Med Chem21:5145-53 (2013) 
 
Heme oxygenase 1
Name:Heme oxygenase 1
Type:Enzyme
Mol. Mass.:33005.15
Organism:Rattus norvegicus (rat)
Description:HO-1 obtained from rat spleen was used in enzyme assays.
Residue:289
BDBM50438651
NameBDBM50438651
Synonyms:CHEMBL2414454
TypeSmall organic molecule
Emp. Form.C13H15IN2O
Mol. Mass.342.1755
SMILESIc1ccc(OCCCCn2ccnc2)cc1