Reaction Details
TargetTyrosine-protein kinase JAK2
LigandBDBM50438670
Substrate/Competitorn/a
Meas. Tech.ChEMBL_976252 (CHEMBL2415137)
Ki 0.500000±n/a nM
Citation Siu, MPastor, RLiu, WBarrett, KBerry, MBlair, WSChang, CChen, JZEigenbrot, CGhilardi, NGibbons, PHe, HHurley, CAKenny, JRCyrus Khojasteh, SLe, HLee, LLyssikatos, JPMagnuson, SPulk, RTsui, VUltsch, MXiao, YZhu, BYSampath, D 2-Amino-[1,2,4]triazolo[1,5-a]pyridines as JAK2 inhibitors. Bioorg Med Chem Lett23:5014-21 (2013) 
 
Tyrosine-protein kinase JAK2
Name:Tyrosine-protein kinase JAK2
Type:Protein
Mol. Mass.:130684.68
Organism:Homo sapiens (Human)
Description:O60674
Residue:1132
BDBM50438670
NameBDBM50438670
Synonyms:CHEMBL2414538
TypeSmall organic molecule
Emp. Form.C20H20N6O2
Mol. Mass.376.4118
SMILESCC(C)Cn1cc(cn1)-c1cccn2nc(Nc3ccc(cc3)C(O)=O)nc12