Reaction Details
TargetTyrosine-protein kinase JAK2
LigandBDBM50438679
Substrate/Competitorn/a
Meas. Tech.ChEMBL_976252 (CHEMBL2415137)
Ki 19±n/a nM
Citation Siu, MPastor, RLiu, WBarrett, KBerry, MBlair, WSChang, CChen, JZEigenbrot, CGhilardi, NGibbons, PHe, HHurley, CAKenny, JRCyrus Khojasteh, SLe, HLee, LLyssikatos, JPMagnuson, SPulk, RTsui, VUltsch, MXiao, YZhu, BYSampath, D 2-Amino-[1,2,4]triazolo[1,5-a]pyridines as JAK2 inhibitors. Bioorg Med Chem Lett23:5014-21 (2013) 
 
Tyrosine-protein kinase JAK2
Name:Tyrosine-protein kinase JAK2
Type:Protein
Mol. Mass.:130684.68
Organism:Homo sapiens (Human)
Description:O60674
Residue:1132
BDBM50438679
NameBDBM50438679
Synonyms:CHEMBL2414555
TypeSmall organic molecule
Emp. Form.C19H17N5O2S
Mol. Mass.379.436
SMILESCc1cc(Nc2nc3cccc(-c4cccc(c4)S(C)(=O)=O)n3n2)ccn1