Reaction Details
TargetTyrosine-protein kinase JAK2
LigandBDBM50438686
Substrate/Competitorn/a
Meas. Tech.ChEMBL_976252 (CHEMBL2415137)
Ki 1.1±n/a nM
Citation Siu, MPastor, RLiu, WBarrett, KBerry, MBlair, WSChang, CChen, JZEigenbrot, CGhilardi, NGibbons, PHe, HHurley, CAKenny, JRCyrus Khojasteh, SLe, HLee, LLyssikatos, JPMagnuson, SPulk, RTsui, VUltsch, MXiao, YZhu, BYSampath, D 2-Amino-[1,2,4]triazolo[1,5-a]pyridines as JAK2 inhibitors. Bioorg Med Chem Lett23:5014-21 (2013) 
 
Tyrosine-protein kinase JAK2
Name:Tyrosine-protein kinase JAK2
Type:Protein
Mol. Mass.:130684.68
Organism:Homo sapiens (Human)
Description:O60674
Residue:1132
BDBM50438686
NameBDBM50438686
Synonyms:CHEMBL2414548
TypeSmall organic molecule
Emp. Form.C21H21N5
Mol. Mass.343.4249
SMILESCC(C)c1cccc(c1)-c1cccc2nc(Nc3ccnc(C)c3)nn12