Reaction Details
TargetTyrosine-protein kinase JAK2
LigandBDBM50438668
Substrate/Competitorn/a
Meas. Tech.ChEMBL_976243 (CHEMBL2415128)
IC50 24±n/a nM
Citation Siu, MPastor, RLiu, WBarrett, KBerry, MBlair, WSChang, CChen, JZEigenbrot, CGhilardi, NGibbons, PHe, HHurley, CAKenny, JRCyrus Khojasteh, SLe, HLee, LLyssikatos, JPMagnuson, SPulk, RTsui, VUltsch, MXiao, YZhu, BYSampath, D 2-Amino-[1,2,4]triazolo[1,5-a]pyridines as JAK2 inhibitors. Bioorg Med Chem Lett23:5014-21 (2013) 
 
Tyrosine-protein kinase JAK2
Name:Tyrosine-protein kinase JAK2
Type:Protein
Mol. Mass.:130684.68
Organism:Homo sapiens (Human)
Description:O60674
Residue:1132
BDBM50438668
NameBDBM50438668
Synonyms:CHEMBL2414540
TypeSmall organic molecule
Emp. Form.C21H20N6O2
Mol. Mass.388.4225
SMILESOC(=O)c1ccc(Nc2nc3c(cccn3n2)-c2cnn(c2)C2CCCC2)cc1