Reaction Details
TargetDiacylglycerol O-acyltransferase 1
LigandBDBM50438726
Substrate/Competitorn/a
Meas. Tech.ChEMBL_976373 (CHEMBL2415509)
IC50 99±n/a nM
Citation Dow, RLAndrews, MPLi, JCMichael Gibbs, EGuzman-Perez, ALaperle, JLLi, QMather, DMunchhof, MJNiosi, MPatel, LPerreault, CTapley, SZavadoski, WJ Defining the key pharmacophore elements of PF-04620110: discovery of a potent, orally-active, neutral DGAT-1 inhibitor. Bioorg Med Chem21:5081-97 (2013) 
 
Diacylglycerol O-acyltransferase 1
Name:Diacylglycerol O-acyltransferase 1
Type:Protein
Mol. Mass.:55297.82
Organism:Homo sapiens (Human)
Description:O75907
Residue:488
BDBM50438726
NameBDBM50438726
Synonyms:CHEMBL2414684
TypeSmall organic molecule
Emp. Form.C22H25N3O4
Mol. Mass.395.4516
SMILESNc1ccnc2OCCN(c3ccc(cc3)[C@H]3CC[C@H](CC(O)=O)CC3)C(=O)c12