Reaction Details
TargetDiacylglycerol O-acyltransferase 1
LigandBDBM50438731
Substrate/Competitorn/a
Meas. Tech.ChEMBL_976373 (CHEMBL2415509)
IC50 70±n/a nM
Citation Dow, RLAndrews, MPLi, JCMichael Gibbs, EGuzman-Perez, ALaperle, JLLi, QMather, DMunchhof, MJNiosi, MPatel, LPerreault, CTapley, SZavadoski, WJ Defining the key pharmacophore elements of PF-04620110: discovery of a potent, orally-active, neutral DGAT-1 inhibitor. Bioorg Med Chem21:5081-97 (2013) 
 
Diacylglycerol O-acyltransferase 1
Name:Diacylglycerol O-acyltransferase 1
Type:Protein
Mol. Mass.:55297.82
Organism:Homo sapiens (Human)
Description:O75907
Residue:488
BDBM50438731
NameBDBM50438731
Synonyms:CHEMBL2414669
TypeSmall organic molecule
Emp. Form.C23H31N5O2
Mol. Mass.409.5245
SMILESCC(C)(N)C[C@H]1CC[C@@H](CC1)c1ccc(cc1)N1CCOc2ncnc(N)c2C1=O