Reaction Details
TargetDiacylglycerol O-acyltransferase 1
LigandBDBM50438736
Substrate/Competitorn/a
Meas. Tech.ChEMBL_976373 (CHEMBL2415509)
IC50 44±n/a nM
Citation Dow, RLAndrews, MPLi, JCMichael Gibbs, EGuzman-Perez, ALaperle, JLLi, QMather, DMunchhof, MJNiosi, MPatel, LPerreault, CTapley, SZavadoski, WJ Defining the key pharmacophore elements of PF-04620110: discovery of a potent, orally-active, neutral DGAT-1 inhibitor. Bioorg Med Chem21:5081-97 (2013) 
 
Diacylglycerol O-acyltransferase 1
Name:Diacylglycerol O-acyltransferase 1
Type:Protein
Mol. Mass.:55297.82
Organism:Homo sapiens (Human)
Description:O75907
Residue:488
BDBM50438736
NameBDBM50438736
Synonyms:CHEMBL2414678
TypeSmall organic molecule
Emp. Form.C22H26N4O4
Mol. Mass.410.4662
SMILESCc1nc(N)c2c(OCCN(c3ccc(cc3)[C@H]3CC[C@H](CC(O)=O)CC3)C2=O)n1